Reaction Details
TargetChorismate synthase
LigandBDBM50123100
Substrate/Competitorn/a
Meas. Tech.ChEBML_49434
IC50 4800±n/a nM
Citation Thomas, MGLawson, CAllanson, NMLeslie, BWBottomley, JRMcBride, AOlusanya, OA A series of 2(Z)-2-benzylidene-6,7-dihydroxybenzofuran-3[2H]-ones as inhibitors of chorismate synthase. Bioorg Med Chem Lett13:423-6 (2003) Chorismate synthase
Name:Chorismate synthase
Type:PROTEIN
Mol. Mass.:42869.22
Organism:Streptococcus pneumoniae
Description:ChEMBL_49433
Residue:388
BDBM50123100
NameBDBM50123100
Synonyms:6,7-Dihydroxy-2-[1-(4-nitro-phenyl)-meth-(E)-ylidene]-benzofuran-3-one | CHEMBL422985
TypeSmall organic molecule
Emp. Form.C15H9NO6
Mol. Mass.299.2351
SMILESOc1ccc2c([O-])c([CH+]c3ccc(cc3)[N+]([O-])=O)oc2c1O