Reaction Details
TargetChorismate synthase
LigandBDBM50123112
Substrate/Competitorn/a
Meas. Tech.ChEBML_49434
IC50 5100±n/a nM
Citation Thomas, MGLawson, CAllanson, NMLeslie, BWBottomley, JRMcBride, AOlusanya, OA A series of 2(Z)-2-benzylidene-6,7-dihydroxybenzofuran-3[2H]-ones as inhibitors of chorismate synthase. Bioorg Med Chem Lett13:423-6 (2003) Chorismate synthase
Name:Chorismate synthase
Type:PROTEIN
Mol. Mass.:42869.22
Organism:Streptococcus pneumoniae
Description:ChEMBL_49433
Residue:388
BDBM50123112
NameBDBM50123112
Synonyms:6,7-Dihydroxy-2-[1-(4-imidazol-1-yl-phenyl)-meth-(E)-ylidene]-benzofuran-3-one | CHEMBL135535
TypeSmall organic molecule
Emp. Form.C18H12N2O4
Mol. Mass.320.2989
SMILESOc1ccc2C(=O)\C(Oc2c1O)=C/c1ccc(cc1)-n1ccnc1