Reaction Details
TargetChorismate synthase
LigandBDBM50123088
Substrate/Competitorn/a
Meas. Tech.ChEBML_49434
IC50 1700±n/a nM
Citation Thomas, MGLawson, CAllanson, NMLeslie, BWBottomley, JRMcBride, AOlusanya, OA A series of 2(Z)-2-benzylidene-6,7-dihydroxybenzofuran-3[2H]-ones as inhibitors of chorismate synthase. Bioorg Med Chem Lett13:423-6 (2003) Chorismate synthase
Name:Chorismate synthase
Type:PROTEIN
Mol. Mass.:42869.22
Organism:Streptococcus pneumoniae
Description:ChEMBL_49433
Residue:388
BDBM50123088
NameBDBM50123088
Synonyms:6,7-Dihydroxy-2-[1-(2-hydroxy-4-methoxy-phenyl)-meth-(E)-ylidene]-benzofuran-3-one | CHEMBL337302
TypeSmall organic molecule
Emp. Form.C16H12O6
Mol. Mass.300.2629
SMILESCOc1ccc(\C=C2\Oc3c(ccc(O)c3O)C2=O)c(O)c1