Reaction Details
TargetChorismate synthase
LigandBDBM50123114
Substrate/Competitorn/a
Meas. Tech.ChEBML_49434
IC50 8500±n/a nM
Citation Thomas, MGLawson, CAllanson, NMLeslie, BWBottomley, JRMcBride, AOlusanya, OA A series of 2(Z)-2-benzylidene-6,7-dihydroxybenzofuran-3[2H]-ones as inhibitors of chorismate synthase. Bioorg Med Chem Lett13:423-6 (2003) Chorismate synthase
Name:Chorismate synthase
Type:PROTEIN
Mol. Mass.:42869.22
Organism:Streptococcus pneumoniae
Description:ChEMBL_49433
Residue:388
BDBM50123114
NameBDBM50123114
Synonyms:2-[1-(4-Diethylamino-phenyl)-meth-(E)-ylidene]-6,7-dihydroxy-benzofuran-3-one | CHEMBL334500
TypeSmall organic molecule
Emp. Form.C19H19NO4
Mol. Mass.325.3585
SMILESCCN(CC)c1ccc(\C=C2\Oc3c(ccc(O)c3O)C2=O)cc1