Reaction Details
TargetAnionic trypsin-2
LigandBDBM50123426
Substrate/Competitorn/a
Meas. Tech.ChEBML_213052
IC50 76±n/a nM
Citation Huang, WZhang, PZuckett, JFWang, LWoolfrey, JSong, YJia, ZJClizbe, LASu, TTran, KHuang, BWong, PSinha, UPark, GReed, AMalinowski, JHollenbach, SJScarborough, RMZhu, BY Design, synthesis and structure-activity relationships of benzoxazinone-based factor Xa inhibitors. Bioorg Med Chem Lett13:561-6 (2003) Anionic trypsin-2
Name:Anionic trypsin-2
Type:PROTEIN
Mol. Mass.:26220.44
Organism:Rattus norvegicus
Description:ChEMBL_213052
Residue:246
BDBM50123426
NameBDBM50123426
Synonyms:2-{7-[1-(1-Imino-ethyl)-piperidin-4-yloxy]-3-oxo-2,3-dihydro-benzo[1,4]oxazin-4-ylmethyl}-1-methyl-1H-indole-6-carboxamidine | CHEMBL152599
TypeSmall organic molecule
Emp. Form.C26H30N6O3
Mol. Mass.474.5548
SMILESCC(=N)N1CCC(CC1)Oc1ccc2N(Cc3cc4ccc(cc4n3C)C(N)=N)C(=O)COc2c1