Reaction Details
TargetAnionic trypsin-2
LigandBDBM50123407
Substrate/Competitorn/a
Meas. Tech.ChEBML_213052
IC50 21±n/a nM
Citation Huang, WZhang, PZuckett, JFWang, LWoolfrey, JSong, YJia, ZJClizbe, LASu, TTran, KHuang, BWong, PSinha, UPark, GReed, AMalinowski, JHollenbach, SJScarborough, RMZhu, BY Design, synthesis and structure-activity relationships of benzoxazinone-based factor Xa inhibitors. Bioorg Med Chem Lett13:561-6 (2003) Anionic trypsin-2
Name:Anionic trypsin-2
Type:PROTEIN
Mol. Mass.:26220.44
Organism:Rattus norvegicus
Description:ChEMBL_213052
Residue:246
BDBM50123407
NameBDBM50123407
Synonyms:2-[({4-[1-(1-Imino-ethyl)-piperidin-4-yloxy]-phenyl}-methanesulfonyl-amino)-methyl]-benzo[b]thiophene-5-carboxamidine | CHEMBL153713
TypeSmall organic molecule
Emp. Form.C24H29N5O3S2
Mol. Mass.499.649
SMILESCC(=N)N1CCC(CC1)Oc1ccc(cc1)N(Cc1cc2cc(ccc2s1)C(N)=N)S(C)(=O)=O