Reaction Details
TargetCoagulation factor X
LigandBDBM50123766
Substrate/Competitorn/a
Meas. Tech.ChEMBL_48660 (CHEMBL657275)
Ki 3±n/a nM
Citation Choi-Sledeski, YMKearney, RPoli, GPauls, HGardner, CGong, YBecker, MDavis, RSpada, ALiang, GChu, VBrown, KCollussi, DLeadley, RRebello, SMoxey, PMorgan, SBentley, RKasiewski, CMaignan, SGuilloteau, JPMikol, V Discovery of an orally efficacious inhibitor of coagulation factor Xa which incorporates a neutral P1 ligand. J Med Chem46:681-4 (2003) 
 
Coagulation factor X
Name:Coagulation factor X
Type:Enzyme
Mol. Mass.:54726.60
Organism:Homo sapiens (Human)
Description:n/a
Residue:488
BDBM50123766
NameBDBM50123766
Synonyms:4-(6-Chloro-benzo[b]thiophene-2-sulfonyl)-1-(1-methyl-1H-pyrrolo[3,2-c]pyridin-2-ylmethyl)-piperazin-2-one | CHEMBL422706
TypeSmall organic molecule
Emp. Form.C21H19ClN4O3S2
Mol. Mass.474.984
SMILESCn1c(CN2CCN(CC2=O)S(=O)(=O)c2cc3ccc(Cl)cc3s2)cc2cnccc12