Reaction Details
TargetCoagulation factor X
LigandBDBM50123785
Substrate/Competitorn/a
Meas. Tech.ChEMBL_48660 (CHEMBL657275)
Ki 38±n/a nM
Citation Choi-Sledeski, YMKearney, RPoli, GPauls, HGardner, CGong, YBecker, MDavis, RSpada, ALiang, GChu, VBrown, KCollussi, DLeadley, RRebello, SMoxey, PMorgan, SBentley, RKasiewski, CMaignan, SGuilloteau, JPMikol, V Discovery of an orally efficacious inhibitor of coagulation factor Xa which incorporates a neutral P1 ligand. J Med Chem46:681-4 (2003) 
 
Coagulation factor X
Name:Coagulation factor X
Type:Enzyme
Mol. Mass.:54726.60
Organism:Homo sapiens (Human)
Description:n/a
Residue:488
BDBM50123785
NameBDBM50123785
Synonyms:4-(6-Chloro-benzo[b]thiophene-2-sulfonyl)-1-(5-oxy-1H-pyrrolo[3,2-c]pyridin-2-ylmethyl)-piperazin-2-one | CHEMBL161432
TypeSmall organic molecule
Emp. Form.C20H17ClN4O4S2
Mol. Mass.476.956
SMILES[O-][n+]1ccc2[nH]c(CN3CCN(CC3=O)S(=O)(=O)c3cc4ccc(Cl)cc4s3)cc2c1