Reaction Details
TargetCoagulation factor X
LigandBDBM50125020
Substrate/Competitorn/a
Meas. Tech.ChEBML_69678
IC50 37±n/a nM
Citation Su, TYang, HVolkots, DWoolfrey, JDam, SWong, PSinha, UScarborough, RMZhu, BY Design, synthesis, and structure-activity relationships of substituted piperazinone-based transition state factor Xa inhibitors. Bioorg Med Chem Lett13:729-32 (2003) Coagulation factor X
Name:Coagulation factor X
Type:Enzyme
Mol. Mass.:54726.60
Organism:Homo sapiens (Human)
Description:n/a
Residue:488
BDBM50125020
NameBDBM50125020
Synonyms:CHEMBL349606 | N-[(S)-4-Guanidino-1-(thiazole-2-carbonyl)-butyl]-2-[(R)-2-oxo-3-(2-oxo-2-piperidin-1-yl-ethyl)-4-phenylmethanesulfonyl-piperazin-1-yl]-acetamide
TypeSmall organic molecule
Emp. Form.C29H40N8O6S2
Mol. Mass.660.808
SMILESNC(=N)NCCC[C@H](NC(=O)CN1CCN([C@H](CC(=O)N2CCCCC2)C1=O)S(=O)(=O)Cc1ccccc1)C(=O)c1nccs1