Reaction Details
TargetProthrombin
LigandBDBM50125027
Substrate/Competitorn/a
Meas. Tech.ChEBML_208864
IC50 3000±n/a nM
Citation Su, TYang, HVolkots, DWoolfrey, JDam, SWong, PSinha, UScarborough, RMZhu, BY Design, synthesis, and structure-activity relationships of substituted piperazinone-based transition state factor Xa inhibitors. Bioorg Med Chem Lett13:729-32 (2003) Prothrombin
Name:Prothrombin
Type:Protein
Mol. Mass.:70029.57
Organism:Homo sapiens (Human)
Description:P00734
Residue:622
BDBM50125027
NameBDBM50125027
Synonyms:((R)-4-{[(S)-4-Guanidino-1-(thiazole-2-carbonyl)-butylcarbamoyl]-methyl}-3-oxo-1-phenylmethanesulfonyl-piperazin-2-yl)-acetic acid ethyl ester | CHEMBL351421
TypeSmall organic molecule
Emp. Form.C26H35N7O7S2
Mol. Mass.621.729
SMILESCCOC(=O)C[C@H]1N(CCN(CC(=O)N[C@@H](CCCNC(N)=N)C(=O)c2nccs2)C1=O)S(=O)(=O)Cc1ccccc1