Reaction Details
TargetProthrombin
LigandBDBM50125022
Substrate/Competitorn/a
Meas. Tech.ChEBML_208864
IC50 2000±n/a nM
Citation Su, TYang, HVolkots, DWoolfrey, JDam, SWong, PSinha, UScarborough, RMZhu, BY Design, synthesis, and structure-activity relationships of substituted piperazinone-based transition state factor Xa inhibitors. Bioorg Med Chem Lett13:729-32 (2003) Prothrombin
Name:Prothrombin
Type:Protein
Mol. Mass.:70029.57
Organism:Homo sapiens (Human)
Description:P00734
Residue:622
BDBM50125022
NameBDBM50125022
Synonyms:CHEMBL163166 | N-[(S)-4-Guanidino-1-(thiazole-2-carbonyl)-butyl]-2-((R)-3-hydroxymethyl-2-oxo-4-phenylmethanesulfonyl-piperazin-1-yl)-acetamide
TypeSmall organic molecule
Emp. Form.C23H31N7O6S2
Mol. Mass.565.666
SMILESNC(=N)NCCC[C@H](NC(=O)CN1CCN([C@H](CO)C1=O)S(=O)(=O)Cc1ccccc1)C(=O)c1nccs1