Reaction Details
TargetCoagulation factor X
LigandBDBM50125025
Substrate/Competitorn/a
Meas. Tech.ChEBML_69678
IC50 0.900000±n/a nM
Citation Su, TYang, HVolkots, DWoolfrey, JDam, SWong, PSinha, UScarborough, RMZhu, BY Design, synthesis, and structure-activity relationships of substituted piperazinone-based transition state factor Xa inhibitors. Bioorg Med Chem Lett13:729-32 (2003) Coagulation factor X
Name:Coagulation factor X
Type:Enzyme
Mol. Mass.:54726.60
Organism:Homo sapiens (Human)
Description:n/a
Residue:488
BDBM50125025
NameBDBM50125025
Synonyms:2-((S)-3-Benzyl-2-oxo-4-phenylmethanesulfonyl-piperazin-1-yl)-N-[(S)-4-guanidino-1-(thiazole-2-carbonyl)-butyl]-acetamide CHEMBL350380
TypeSmall organic molecule
Emp. Form.C29H35N7O5S2
Mol. Mass.625.762
SMILESNC(=N)NCCC[C@H](NC(=O)CN1CCN([C@@H](Cc2ccccc2)C1=O)S(=O)(=O)Cc1ccccc1)C(=O)c1nccs1