Reaction Details
TargetCoagulation factor X
LigandBDBM50125037
Substrate/Competitorn/a
Meas. Tech.ChEBML_69678
IC50 4±n/a nM
Citation Su, TYang, HVolkots, DWoolfrey, JDam, SWong, PSinha, UScarborough, RMZhu, BY Design, synthesis, and structure-activity relationships of substituted piperazinone-based transition state factor Xa inhibitors. Bioorg Med Chem Lett13:729-32 (2003) Coagulation factor X
Name:Coagulation factor X
Type:Enzyme
Mol. Mass.:54726.60
Organism:Homo sapiens (Human)
Description:n/a
Residue:488
BDBM50125037
NameBDBM50125037
Synonyms:CHEMBL435059 | N-[(S)-4-Guanidino-1-(thiazole-2-carbonyl)-butyl]-2-[(R)-2-oxo-3-(3-oxo-3-piperidin-1-yl-propyl)-4-phenylmethanesulfonyl-piperazin-1-yl]-acetamide
TypeSmall organic molecule
Emp. Form.C30H42N8O6S2
Mol. Mass.674.834
SMILESNC(=N)NCCC[C@H](NC(=O)CN1CCN([C@H](CCC(=O)N2CCCCC2)C1=O)S(=O)(=O)Cc1ccccc1)C(=O)c1nccs1