Reaction Details
TargetCoagulation factor X
LigandBDBM50079240
Substrate/Competitorn/a
Meas. Tech.ChEBML_69674
Ki 0.110000±n/a nM
Citation Quan, MLEllis, CDHe, MYLiauw, AYLam, PYRossi, KAKnabb, RMLuettgen, JMWright, MRWong, PCWexler, RR Nonbenzamidine isoxazoline derivatives as factor Xa inhibitors. Bioorg Med Chem Lett13:1023-8 (2003) Coagulation factor X
Name:Coagulation factor X
Type:Enzyme
Mol. Mass.:54726.60
Organism:Homo sapiens (Human)
Description:n/a
Residue:488
BDBM50079240
NameBDBM50079240
Synonyms:3-(3-Carbamimidoyl-phenyl)-5-tetrazol-1-ylmethyl-4,5-dihydro-isoxazole-5-carboxylic acid [5-(2-sulfamoyl-phenyl)-pyridin-2-yl]-amide; TFA CHEMBL93210
TypeSmall organic molecule
Emp. Form.C24H22N10O4S
Mol. Mass.546.561
SMILESNC(=N)c1cccc(c1)C1=NOC(Cn2cnnn2)(C1)C(=O)Nc1ccc(cn1)-c1ccccc1S(N)(=O)=O