Reaction Details
TargetSerine protease 1
LigandBDBM50125242
Substrate/Competitorn/a
Meas. Tech.ChEMBL_212863 (CHEMBL878974)
Ki>4200±n/a nM
Citation Quan, MLEllis, CDHe, MYLiauw, AYLam, PYRossi, KAKnabb, RMLuettgen, JMWright, MRWong, PCWexler, RR Nonbenzamidine isoxazoline derivatives as factor Xa inhibitors. Bioorg Med Chem Lett13:1023-8 (2003) Serine protease 1
Name:Serine protease 1
Type:Enzyme
Mol. Mass.:26557.80
Organism:Homo sapiens (Human)
Description:P07477
Residue:247
BDBM50125242
NameBDBM50125242
Synonyms:3-(3-Amino-4-chloro-phenyl)-5-(methanesulfonylamino-methyl)-4,5-dihydro-isoxazole-5-carboxylic acid [5-(2-sulfamoyl-phenyl)-pyridin-2-yl]-amide | CHEMBL7626
TypeSmall organic molecule
Emp. Form.C23H23ClN6O6S2
Mol. Mass.579.048
SMILESCS(=O)(=O)NCC1(CC(=NO1)c1ccc(Cl)c(N)c1)C(=O)Nc1ccc(cn1)-c1ccccc1S(N)(=O)=O