Reaction Details
TargetCytochrome P450 3A4
LigandBDBM50125272
Substrate/Competitorn/a
Meas. Tech.ChEBML_52064
IC50 18000±n/a nM
Citation Blackie, JABloomer, JCBrown, MJCheng, HYHammond, BHickey, DMIfe, RJLeach, CALewis, VAMacphee, CHMilliner, KJMoores, KEPinto, ILSmith, SAStansfield, IGStanway, SJTaylor, MATheobald, CJ The identification of clinical candidate SB-480848: a potent inhibitor of lipoprotein-associated phospholipase A2. Bioorg Med Chem Lett13:1067-70 (2003) Cytochrome P450 3A4
Name:Cytochrome P450 3A4
Type:Enzyme
Mol. Mass.:57349.57
Organism:Homo sapiens (Human)
Description:n/a
Residue:503
BDBM50125272
NameBDBM50125272
Synonyms:CHEMBL10663 | N-(4'-Chloro-biphenyl-4-ylmethyl)-N-(2-diethylamino-ethyl)-2-[2-(4-fluoro-benzylsulfanyl)-4-oxo-4,5,6,7-tetrahydro-cyclopentapyrimidin-1-yl]-acetamide
TypeSmall organic molecule
Emp. Form.C35H38ClFN4O2S
Mol. Mass.633.218
SMILESCCN(CC)CCN(Cc1ccc(cc1)-c1ccc(Cl)cc1)C(=O)Cn1c2CCCc2c(=O)nc1SCc1ccc(F)cc1