Reaction Details
TargetPlatelet-activating factor acetylhydrolase
LigandBDBM50125281
Substrate/Competitorn/a
Meas. Tech.ChEBML_101008
IC50 38±n/a nM
Citation Blackie, JABloomer, JCBrown, MJCheng, HYHammond, BHickey, DMIfe, RJLeach, CALewis, VAMacphee, CHMilliner, KJMoores, KEPinto, ILSmith, SAStansfield, IGStanway, SJTaylor, MATheobald, CJ The identification of clinical candidate SB-480848: a potent inhibitor of lipoprotein-associated phospholipase A2. Bioorg Med Chem Lett13:1067-70 (2003) Platelet-activating factor acetylhydrolase
Name:Platelet-activating factor acetylhydrolase
Type:PROTEIN
Mol. Mass.:50084.41
Organism:Homo sapiens (Human)
Description:ChEMBL_156212
Residue:441
BDBM50125281
NameBDBM50125281
Synonyms:2-[5-(2-Amino-ethyl)-2-(4-fluoro-benzylsulfanyl)-4-oxo-4H-pyrimidin-1-yl]-N-(2-diethylamino-ethyl)-N-(4'-trifluoromethyl-biphenyl-4-ylmethyl)-acetamide | CHEMBL10619
TypeSmall organic molecule
Emp. Form.C35H39F4N5O2S
Mol. Mass.669.775
SMILESCCN(CC)CCN(Cc1ccc(cc1)-c1ccc(cc1)C(F)(F)F)C(=O)Cn1cc(CCN)c(=O)nc1SCc1ccc(F)cc1