Reaction Details
TargetB2 bradykinin receptor
LigandBDBM50126229
Substrate/Competitorn/a
Meas. Tech.ChEBML_40424
Ki 38±n/a nM
Citation Youngman, MACarson, JRLee, JSDax, SLZhang, SPColburn, RWStone, DJCodd, EEJetter, MC Synthesis and structure--activity relationships of aroylpyrrole alkylamide bradykinin (B2) antagonists. Bioorg Med Chem Lett13:1341-4 (2003) B2 bradykinin receptor
Name:B2 bradykinin receptor
Type:Enzyme Catalytic Domain
Mol. Mass.:44467.17
Organism:Homo sapiens (Human)
Description:B2 BRADYKININ BDKRB2 HUMAN::P30411
Residue:391
BDBM50126229
NameBDBM50126229
Synonyms:3-[5-(6-Chloro-pyridine-3-carbonyl)-1-methyl-1H-pyrrol-2-yl]-N-[2,4-dichloro-3-(2-methyl-quinolin-8-yloxymethyl)-phenyl]-N-methyl-propionamide | CHEMBL287018
TypeSmall organic molecule
Emp. Form.C32H27Cl3N4O3
Mol. Mass.621.941
SMILESCN(C(=O)CCc1ccc(C(=O)c2ccc(Cl)nc2)n1C)c1ccc(Cl)c(COc2cccc3ccc(C)nc23)c1Cl