Reaction Details
Target5-hydroxytryptamine receptor 6
LigandBDBM50019754
Substrate/Competitorn/a
Meas. Tech.ChEMBL_2079766 (CHEMBL4735557)
Ki 6.9±n/a nM
Citation Toublet, FXLalut, JHatat, BLecoutey, CDavis, ASince, MCorvaisier, SFreret, TSopková-de Oliveira Santos, JClaeysen, SBoulouard, MDallemagne, PRochais, C Pleiotropic prodrugs: Design of a dual butyrylcholinesterase inhibitor and 5-HT Eur J Med Chem210:0 (2021) 
 
5-hydroxytryptamine receptor 6
Name:5-hydroxytryptamine receptor 6
Type:G Protein-Coupled Receptor (GPCR)
Mol. Mass.:46968.43
Organism:Homo sapiens (Human)
Description:P50406
Residue:440
BDBM50019754
NameBDBM50019754
Synonyms:IDALOPIRDINE | LU-AE58054
TypeSmall organic molecule
Emp. Form.C20H19F5N2O
Mol. Mass.398.3697
SMILESFC(F)C(F)(F)COc1cccc(CNCCc2c[nH]c3cc(F)ccc23)c1