Reaction Details
Target5-hydroxytryptamine receptor 7
LigandBDBM28583
Substrate/Competitorn/a
Meas. Tech.ChEMBL_2079770 (CHEMBL4735561)
Ki 3.0±n/a nM
Citation Toublet, FXLalut, JHatat, BLecoutey, CDavis, ASince, MCorvaisier, SFreret, TSopková-de Oliveira Santos, JClaeysen, SBoulouard, MDallemagne, PRochais, C Pleiotropic prodrugs: Design of a dual butyrylcholinesterase inhibitor and 5-HT Eur J Med Chem210:0 (2021) 
 
5-hydroxytryptamine receptor 7
Name:5-hydroxytryptamine receptor 7
Type:G Protein-Coupled Receptor (GPCR)
Mol. Mass.:53573.08
Organism:Homo sapiens (Human)
Description:P34969
Residue:479
BDBM28583
NameBDBM28583
Synonyms:5-chloro-N-[4-methoxy-3-(piperazin-1-yl)phenyl]-3-methyl-1-benzothiophene-2-sulfonamide hydrochloride SB 271046 | SB-271046
TypeSmall organic molecule
Emp. Form.C20H22ClN3O3S2
Mol. Mass.451.99
SMILESCOc1ccc(NS(=O)(=O)c2sc3ccc(Cl)cc3c2C)cc1N1CCNCC1