Reaction Details
TargetMatrix metalloproteinase-9
LigandBDBM50126623
Substrate/Competitorn/a
Meas. Tech.ChEBML_105528
IC50 2±n/a nM
Citation Zask, AGu, YAlbright, JDDu, XHogan, MLevin, JIChen, JMKillar, LMSung, ADiJoseph, JFSharr, MARoth, CESkala, SJin, GCowling, RMohler, KMBarone, DBlack, RMarch, CSkotnicki, JS Synthesis and SAR of bicyclic heteroaryl hydroxamic acid MMP and TACE inhibitors. Bioorg Med Chem Lett13:1487-90 (2003) Matrix metalloproteinase-9
Name:Matrix metalloproteinase-9
Type:Enzyme
Mol. Mass.:78452.28
Organism:Homo sapiens (Human)
Description:P14780
Residue:707
BDBM50126623
NameBDBM50126623
Synonyms:8-Methoxy-4-[(4-methoxy-benzenesulfonyl)-pyridin-3-ylmethyl-amino]-quinoline-3-carboxylic acid hydroxyamide N-hydroxy-8-methoxy-4-(4-methoxy-N-(pyridin-3-ylmethyl)phenylsulfonamido)quinoline-3-carboxamide
TypeSmall organic molecule
Emp. Form.C24H22N4O6S
Mol. Mass.494.52
SMILESCOc1ccc(cc1)S(=O)(=O)N(Cc1cccnc1)c1c(cnc2c(OC)cccc12)C(=O)NO