Reaction Details
TargetMatrix metalloproteinase-9
LigandBDBM50126626
Substrate/Competitorn/a
Meas. Tech.ChEBML_105528
IC50 1±n/a nM
Citation Zask, AGu, YAlbright, JDDu, XHogan, MLevin, JIChen, JMKillar, LMSung, ADiJoseph, JFSharr, MARoth, CESkala, SJin, GCowling, RMohler, KMBarone, DBlack, RMarch, CSkotnicki, JS Synthesis and SAR of bicyclic heteroaryl hydroxamic acid MMP and TACE inhibitors. Bioorg Med Chem Lett13:1487-90 (2003) Matrix metalloproteinase-9
Name:Matrix metalloproteinase-9
Type:Enzyme
Mol. Mass.:78452.28
Organism:Homo sapiens (Human)
Description:P14780
Residue:707
BDBM50126626
NameBDBM50126626
Synonyms:4-{Methyl-[4-(pyridin-4-yloxy)-benzenesulfonyl]-amino}-quinoline-3-carboxylic acid hydroxyamide N-hydroxy-4-(N-methyl-4-(pyridin-4-yloxy)phenylsulfonamido)quinoline-3-carboxamide
TypeSmall organic molecule
Emp. Form.C22H18N4O5S
Mol. Mass.450.467
SMILESCN(c1c(cnc2ccccc12)C(=O)NO)S(=O)(=O)c1ccc(Oc2ccncc2)cc1