Reaction Details
TargetKappa-type opioid receptor
LigandBDBM50126765
Substrate/Competitorn/a
Meas. Tech.ChEMBL_145820 (CHEMBL753681)
Ki 15±n/a nM
Citation Holzgrabe, UBrandt, W Mechanism of action of the diazabicyclononanone-type kappa-agonists. J Med Chem46:1383-9 (2003) 
 
Kappa-type opioid receptor
Name:Kappa-type opioid receptor
Type:G Protein-Coupled Receptor (GPCR)
Mol. Mass.:42692.90
Organism:Rattus norvegicus (rat)
Description:P34975
Residue:380
BDBM50126765
NameBDBM50126765
Synonyms:3,7-Dimethyl-2,4-di-pyridin-2-yl-3,7-diaza-bicyclo[3.3.1]nonan-9-one | CHEMBL287392
TypeSmall organic molecule
Emp. Form.C19H22N4O
Mol. Mass.322.4042
SMILESCN1CC2C(N(C)C(C(C1)C2=O)c1ccccn1)c1ccccn1