Reaction Details
TargetGeranylgeranyl transferase type-1 subunit beta
LigandBDBM50127300
Substrate/Competitorn/a
Meas. Tech.ChEBML_71806
IC50 960±n/a nM
Citation Tong, YLin, NHWang, LHasvold, LWang, WLeonard, NLi, TLi, QCohen, JGu, WZZhang, HStoll, VBauch, JMarsh, KRosenberg, SHSham, HL Discovery of potent imidazole and cyanophenyl containing farnesyltransferase inhibitors with improved oral bioavailability. Bioorg Med Chem Lett13:1571-4 (2003) Geranylgeranyl transferase type-1 subunit beta
Name:Geranylgeranyl transferase type-1 subunit beta
Type:n/a
Mol. Mass.:42369.84
Organism:Homo sapiens (Human)
Description:n/a
Residue:377
BDBM50127300
NameBDBM50127300
Synonyms:5-[(3',5'-Dichloro-5-cyano-biphenyl-2-ylmethoxy)-(3-methyl-3H-imidazol-4-yl)-methyl]-pyridine-2-carbonitrile | CHEMBL289844
TypeSmall organic molecule
Emp. Form.C25H17Cl2N5O
Mol. Mass.474.341
SMILESCn1cncc1C(OCc1ccc(cc1-c1cc(Cl)cc(Cl)c1)C#N)c1ccc(nc1)C#N