Reaction Details
TargetGeranylgeranyl transferase type-1 subunit beta
LigandBDBM50127319
Substrate/Competitorn/a
Meas. Tech.ChEBML_71806
IC50>10±n/a nM
Citation Tong, YLin, NHWang, LHasvold, LWang, WLeonard, NLi, TLi, QCohen, JGu, WZZhang, HStoll, VBauch, JMarsh, KRosenberg, SHSham, HL Discovery of potent imidazole and cyanophenyl containing farnesyltransferase inhibitors with improved oral bioavailability. Bioorg Med Chem Lett13:1571-4 (2003) Geranylgeranyl transferase type-1 subunit beta
Name:Geranylgeranyl transferase type-1 subunit beta
Type:n/a
Mol. Mass.:42369.84
Organism:Homo sapiens (Human)
Description:n/a
Residue:377
BDBM50127319
NameBDBM50127319
Synonyms:5-[(2-Benzo[1,3]dioxol-5-yl-4-cyano-benzyloxy)-(3-methyl-3H-imidazol-4-yl)-methyl]-pyridine-2-carbonitrile | CHEMBL288449
TypeSmall organic molecule
Emp. Form.C26H19N5O3
Mol. Mass.449.4608
SMILESCn1cncc1C(OCc1ccc(cc1-c1ccc2OCOc2c1)C#N)c1ccc(nc1)C#N