Reaction Details
TargetGeranylgeranyl transferase type-1 subunit beta
LigandBDBM50127330
Substrate/Competitorn/a
Meas. Tech.ChEBML_71806
IC50 2600±n/a nM
Citation Tong, YLin, NHWang, LHasvold, LWang, WLeonard, NLi, TLi, QCohen, JGu, WZZhang, HStoll, VBauch, JMarsh, KRosenberg, SHSham, HL Discovery of potent imidazole and cyanophenyl containing farnesyltransferase inhibitors with improved oral bioavailability. Bioorg Med Chem Lett13:1571-4 (2003) Geranylgeranyl transferase type-1 subunit beta
Name:Geranylgeranyl transferase type-1 subunit beta
Type:n/a
Mol. Mass.:42369.84
Organism:Homo sapiens (Human)
Description:n/a
Residue:377
BDBM50127330
NameBDBM50127330
Synonyms:6-[(4-Cyano-phenyl)-(3-methyl-3H-imidazol-4-yl)-methoxymethyl]-2-naphthalen-2-yl-nicotinonitrile | CHEMBL38974
TypeSmall organic molecule
Emp. Form.C29H21N5O
Mol. Mass.455.5099
SMILESCn1cncc1C(OCc1ccc(C#N)c(n1)-c1ccc2ccccc2c1)c1ccc(cc1)C#N