Reaction Details
TargetHistamine H3 receptor
LigandBDBM50127605
Substrate/Competitorn/a
Meas. Tech.ChEMBL_83635 (CHEMBL695765)
EC50 42±n/a nM
Citation Kazuta, YHirano, KNatsume, KYamada, SKimura, RMatsumoto, SFuruichi, KMatsuda, AShuto, S Cyclopropane-based conformational restriction of histamine. (1S,2S)-2-(2-aminoethyl)-1-(1H-imidazol-4-yl)cyclopropane, a highly selective agonist for the histamine H3 receptor, having a cis-cyclopropane structure. J Med Chem46:1980-8 (2003) 
 
Histamine H3 receptor
Name:Histamine H3 receptor
Type:G Protein-Coupled Receptor (GPCR)
Mol. Mass.:48691.47
Organism:Homo sapiens (Human)
Description:Binding assays were using CHO cells stably expressing hH3R receptors.
Residue:445
BDBM50127605
NameBDBM50127605
Synonyms:(1S,2S)-2-(1H-Imidazol-4-yl)-cyclopropylamine 2-(1H-Imidazol-4-yl)-cyclopropylamine VUF-5297
TypeSmall organic molecule
Emp. Form.C6H9N3
Mol. Mass.123.1558
SMILESN[C@H]1C[C@@H]1c1cnc[nH]1