Reaction Details
TargetPlasminogen activator inhibitor 1
LigandBDBM50127733
Substrate/Competitorn/a
Meas. Tech.ChEBML_155613
IC50 100±n/a nM
Citation De Nanteuil, GLila-Ambroise, CRupin, AVallez, MOVerbeuren, TJ New fibrinolytic agents: benzothiophene derivatives as inhibitors of the t-PA-PAI-1 complex formation. Bioorg Med Chem Lett13:1705-8 (2003) Plasminogen activator inhibitor 1
Name:Plasminogen activator inhibitor 1
Type:Enzyme
Mol. Mass.:45064.00
Organism:Homo sapiens (Human)
Description:P05121
Residue:402
BDBM50127733
NameBDBM50127733
Synonyms:(E)-3-[5,6-Bis-(biphenyl-4-ylmethoxy)-3-phenoxy-benzo[b]thiophen-2-yl]-2-pyridin-4-yl-acrylic acid | CHEMBL295776
TypeSmall organic molecule
Emp. Form.C48H35NO5S
Mol. Mass.737.86
SMILESOC(=O)C(=C\c1sc2cc(OCc3ccc(cc3)-c3ccccc3)c(OCc3ccc(cc3)-c3ccccc3)cc2c1Oc1ccccc1)\c1ccncc1