Reaction Details
TargetDihydrofolate reductase
LigandBDBM50128538
Substrate/Competitorn/a
Meas. Tech.ChEMBL_53156 (CHEMBL665665)
IC50 6±n/a nM
Citation Wyss, PCGerber, PHartman, PGHubschwerlen, CLocher, HMarty, HPStahl, M Novel dihydrofolate reductase inhibitors. Structure-based versus diversity-based library design and high-throughput synthesis and screening. J Med Chem46:2304-12 (2003) 
 
Dihydrofolate reductase
Name:Dihydrofolate reductase
Type:Enzyme
Mol. Mass.:21453.99
Organism:Homo sapiens (Human)
Description:Recombinant human DHFR.
Residue:187
BDBM50128538
NameBDBM50128538
Synonyms:5-[7-Methoxy-4-(3-nitro-phenyl)-3,4-dihydro-1H-isoquinolin-2-ylmethyl]-pyrimidine-2,4-diamine | CHEMBL78104
TypeSmall organic molecule
Emp. Form.C21H22N6O3
Mol. Mass.406.4378
SMILESCOc1ccc2C(CN(Cc3cnc(N)nc3N)Cc2c1)c1cccc(c1)[N+]([O-])=O