Reaction Details
TargetDihydrofolate reductase
LigandBDBM50128540
Substrate/Competitorn/a
Meas. Tech.ChEMBL_53146 (CHEMBL665866)
IC50 7800±n/a nM
Citation Wyss, PCGerber, PHartman, PGHubschwerlen, CLocher, HMarty, HPStahl, M Novel dihydrofolate reductase inhibitors. Structure-based versus diversity-based library design and high-throughput synthesis and screening. J Med Chem46:2304-12 (2003) 
 
Dihydrofolate reductase
Name:Dihydrofolate reductase
Type:PROTEIN
Mol. Mass.:18232.79
Organism:Staphylococcus aureus (strain MW2)
Description:ChEMBL_53146
Residue:159
BDBM50128540
NameBDBM50128540
Synonyms:5-(1,3,4,9-Tetrahydro-beta-carbolin-2-ylmethyl)-pyrimidine-2,4-diamine | CHEMBL75944
TypeSmall organic molecule
Emp. Form.C16H18N6
Mol. Mass.294.3543
SMILESNc1ncc(CN2CCc3c(C2)[nH]c2ccccc32)c(N)n1