Reaction Details
TargetCalpain-1 catalytic subunit
LigandBDBM50128682
Substrate/Competitorn/a
Meas. Tech.ChEMBL_43669 (CHEMBL656202)
Ki 27±n/a nM
Citation Lubisch, WBeckenbach, EBopp, SHofmann, HPKartal, AKästel, CLindner, TMetz-Garrecht, MReeb, JRegner, FVierling, MMöller, A Benzoylalanine-derived ketoamides carrying vinylbenzyl amino residues: discovery of potent water-soluble calpain inhibitors with oral bioavailability. J Med Chem46:2404-12 (2003) 
 
Calpain-1 catalytic subunit
Name:Calpain-1 catalytic subunit
Type:Protein
Mol. Mass.:81880.51
Organism:Homo sapiens (Human)
Description:n/a
Residue:714
BDBM50128682
NameBDBM50128682
Synonyms:CHEMBL80605 | N-(1-Carbamoyl-2-phenyl-ethyl)-2-[2-(4-diethylaminomethyl-phenyl)-vinyl]-benzamide
TypeSmall organic molecule
Emp. Form.C29H33N3O2
Mol. Mass.455.5912
SMILESCCN(CC)Cc1ccc(\C=C\c2ccccc2C(=O)NC(Cc2ccccc2)C(N)=O)cc1