Reaction Details
TargetSubstance-K receptor
LigandBDBM50129506
Substrate/Competitorn/a
Meas. Tech.ChEBML_209018
IC50 6.5±n/a nM
Citation MacKenzie, ARMarchington, APMiddleton, DSNewman, SDSelway, CNTerrett, NK 4-Amino-2-(aryl)-butylbenzamides and Their conformationally constrained analogues. Potent antagonists of the human neurokinin-2 (NK(2)) receptor. Bioorg Med Chem Lett13:2211-5 (2003) Substance-K receptor
Name:Substance-K receptor
Type:Protein
Mol. Mass.:44455.78
Organism:Homo sapiens (Human)
Description:P21452
Residue:398
BDBM50129506
NameBDBM50129506
Synonyms:CHEMBL308901 | {3-(3,4-Dichloro-phenyl)-3-[2-(3-morpholin-4-yl-azetidin-1-yl)-ethyl]-pyrrolidin-1-yl}-(2-methoxy-phenyl)-methanone
TypeSmall organic molecule
Emp. Form.C27H33Cl2N3O3
Mol. Mass.518.475
SMILESCOc1ccccc1C(=O)N1CCC(CCN2CC(C2)N2CCOCC2)(C1)c1ccc(Cl)c(Cl)c1