Reaction Details
TargetSubstance-K receptor
LigandBDBM50129517
Substrate/Competitorn/a
Meas. Tech.ChEBML_209018
IC50 6.6±n/a nM
Citation MacKenzie, ARMarchington, APMiddleton, DSNewman, SDSelway, CNTerrett, NK 4-Amino-2-(aryl)-butylbenzamides and Their conformationally constrained analogues. Potent antagonists of the human neurokinin-2 (NK(2)) receptor. Bioorg Med Chem Lett13:2211-5 (2003) Substance-K receptor
Name:Substance-K receptor
Type:Protein
Mol. Mass.:44455.78
Organism:Homo sapiens (Human)
Description:P21452
Residue:398
BDBM50129517
NameBDBM50129517
Synonyms:CHEMBL307338 | N-{2-(3,4-Dichloro-phenyl)-4-[4-hydroxy-4-(1H-imidazol-2-yl)-piperidin-1-yl]-butyl}-N-methyl-benzamide
TypeSmall organic molecule
Emp. Form.C26H30Cl2N4O2
Mol. Mass.501.448
SMILESCN(CC(CCN1CCC(O)(CC1)c1ncc[nH]1)c1ccc(Cl)c(Cl)c1)C(=O)c1ccccc1