Reaction Details
TargetSubstance-K receptor
LigandBDBM50129519
Substrate/Competitorn/a
Meas. Tech.ChEBML_209018
IC50 6.7±n/a nM
Citation MacKenzie, ARMarchington, APMiddleton, DSNewman, SDSelway, CNTerrett, NK 4-Amino-2-(aryl)-butylbenzamides and Their conformationally constrained analogues. Potent antagonists of the human neurokinin-2 (NK(2)) receptor. Bioorg Med Chem Lett13:2211-5 (2003) Substance-K receptor
Name:Substance-K receptor
Type:Protein
Mol. Mass.:44455.78
Organism:Homo sapiens (Human)
Description:P21452
Residue:398
BDBM50129519
NameBDBM50129519
Synonyms:4-(1-{2-[1-Benzenesulfonyl-3-(3,4-dichloro-phenyl)-pyrrolidin-3-yl]-ethyl}-azetidin-3-yl)-morpholine | CHEMBL70157
TypeSmall organic molecule
Emp. Form.C25H31Cl2N3O3S
Mol. Mass.524.503
SMILESClc1ccc(cc1Cl)C1(CCN2CC(C2)N2CCOCC2)CCN(C1)S(=O)(=O)c1ccccc1