Reaction Details
TargetSubstance-K receptor
LigandBDBM50129522
Substrate/Competitorn/a
Meas. Tech.ChEBML_209018
IC50 7.7±n/a nM
Citation MacKenzie, ARMarchington, APMiddleton, DSNewman, SDSelway, CNTerrett, NK 4-Amino-2-(aryl)-butylbenzamides and Their conformationally constrained analogues. Potent antagonists of the human neurokinin-2 (NK(2)) receptor. Bioorg Med Chem Lett13:2211-5 (2003) Substance-K receptor
Name:Substance-K receptor
Type:Protein
Mol. Mass.:44455.78
Organism:Homo sapiens (Human)
Description:P21452
Residue:398
BDBM50129522
NameBDBM50129522
Synonyms:CHEMBL68917 | N-[2-(3,4-Dichloro-phenyl)-4-(4-imidazol-1-yl-piperidin-1-yl)-butyl]-N-methyl-benzamide
TypeSmall organic molecule
Emp. Form.C26H30Cl2N4O
Mol. Mass.485.449
SMILESCN(CC(CCN1CCC(CC1)n1ccnc1)c1ccc(Cl)c(Cl)c1)C(=O)c1ccccc1