Reaction Details
TargetRetinoic acid receptor RXR-alpha
LigandBDBM50129726
Substrate/Competitorn/a
Meas. Tech.ChEMBL_196768 (CHEMBL798929)
Ki 2±n/a nM
Citation Michellys, PYArdecky, RJChen, JHCrombie, DLEtgen, GJFaul, MMFaulkner, ALGrese, TAHeyman, RAKaranewsky, DSKlausing, KLeibowitz, MDLiu, SMais, DAMapes, CMMarschke, KBReifel-Miller, AOgilvie, KMRungta, DThompson, AWTyhonas, JSBoehm, MF Novel (2E,4E,6Z)-7-(2-alkoxy-3,5-dialkylbenzene)-3-methylocta-2,4,6-trienoic acid retinoid X receptor modulators are active in models of type 2 diabetes. J Med Chem46:2683-96 (2003) 
 
Retinoic acid receptor RXR-alpha
Name:Retinoic acid receptor RXR-alpha
Type:PROTEIN
Mol. Mass.:50820.38
Organism:Homo sapiens (Human)
Description:ChEMBL_1456363
Residue:462
BDBM50129726
NameBDBM50129726
Synonyms:(2E,4E,6Z)-7-(2-Ethoxy-3,5-diisopropyl-phenyl)-3-methyl-octa-2,4,6-trienoic acid CHEMBL88740
TypeSmall organic molecule
Emp. Form.C23H32O3
Mol. Mass.356.4984
SMILESCCOc1c(cc(cc1\C(C)=C/C=C/C(/C)=C/C(O)=O)C(C)C)C(C)C