Reaction Details
TargetPeroxisome proliferator-activated receptor gamma/Retinoic acid receptor RXR-alpha
LigandBDBM50129729
Substrate/Competitorn/a
Meas. Tech.ChEMBL_44334 (CHEMBL651610)
EC50 19±n/a nM
Citation Michellys, PYArdecky, RJChen, JHCrombie, DLEtgen, GJFaul, MMFaulkner, ALGrese, TAHeyman, RAKaranewsky, DSKlausing, KLeibowitz, MDLiu, SMais, DAMapes, CMMarschke, KBReifel-Miller, AOgilvie, KMRungta, DThompson, AWTyhonas, JSBoehm, MF Novel (2E,4E,6Z)-7-(2-alkoxy-3,5-dialkylbenzene)-3-methylocta-2,4,6-trienoic acid retinoid X receptor modulators are active in models of type 2 diabetes. J Med Chem46:2683-96 (2003) 
 
Peroxisome proliferator-activated receptor gamma/Retinoic acid receptor RXR-alpha
Name:Peroxisome proliferator-activated receptor gamma/Retinoic acid receptor RXR-alpha
Type:n/a
Mol. Mass.:n/a
Description:ASSAY_ID of EBI is 43803
Components:This complex has 3 components.
Component 1
Name:Peroxisome proliferator-activated receptor gamma
Synonyms:NR1C3 PPAR-gamma PPARG_HUMAN Peroxisome proliferator-activated receptor gamma (PPAR gamma) Peroxisome proliferator-activated receptor gamma (PPARĪ³) peroxisome proliferator-activated receptor gamma isoform 2
Type:Nuclear Receptor
Mol. Mass.:57613.46
Organism:Homo sapiens (Human)
Description:P37231
Residue:505
Component 2
Name:Retinoic acid receptor RXR-alpha
Synonyms:NR2B1 Nuclear receptor subfamily 4 group A member 2 RXRA Retinoic acid receptor RXR-alpha/gamma Retinoid receptor
Type:PROTEIN
Mol. Mass.:50820.38
Organism:Homo sapiens (Human)
Description:ChEMBL_1456363
Residue:462
BDBM50129729
NameBDBM50129729
Synonyms:7-[3,5-Bis-(1,1-dimethyl-propyl)-2-propoxy-phenyl]-3-methyl-octa-2,4,6-trienoic acid | CHEMBL90254
TypeSmall organic molecule
Emp. Form.C28H42O3
Mol. Mass.426.6313
SMILESCCCOc1c(cc(cc1C(C)(C)CC)C(C)(C)CC)C(\C)=C/C=C/C(/C)=C/C(O)=O