Reaction Details
Target5-hydroxytryptamine receptor 2C
LigandBDBM50130068
Substrate/Competitorn/a
Meas. Tech.ChEMBL_3044 (CHEMBL620662)
Ki 4±n/a nM
Citation Ennis, MDHoffman, RLGhazal, NBOlson, RMKnauer, CSChio, CLHyslop, DKCampbell, JEFitzgerald, LWNichols, NFSvensson, KAMcCall, RBHaber, CLKagey, MLDinh, DM 2,3,4,5-tetrahydro- and 2,3,4,5,11,11a-hexahydro-1H-[1,4]diazepino[1,7-a]indoles: new templates for 5-HT(2C) agonists. Bioorg Med Chem Lett13:2369-72 (2003) 5-hydroxytryptamine receptor 2C
Name:5-hydroxytryptamine receptor 2C
Type:G Protein-Coupled Receptor (GPCR)
Mol. Mass.:51836.79
Organism:Homo sapiens (Human)
Description:P28335
Residue:458
BDBM50130068
NameBDBM50130068
Synonyms:(S)-2-(6-Fluoro-indol-1-yl)-1-methyl-ethylamine | CHEMBL80226
TypeSmall organic molecule
Emp. Form.C11H13FN2
Mol. Mass.192.2327
SMILESC[C@H](N)Cn1ccc2ccc(F)cc12