Reaction Details
Target5-hydroxytryptamine receptor 2C
LigandBDBM50130083
Substrate/Competitorn/a
Meas. Tech.ChEBML_3044
Ki 12±n/a nM
Citation Ennis, MDHoffman, RLGhazal, NBOlson, RMKnauer, CSChio, CLHyslop, DKCampbell, JEFitzgerald, LWNichols, NFSvensson, KAMcCall, RBHaber, CLKagey, MLDinh, DM 2,3,4,5-tetrahydro- and 2,3,4,5,11,11a-hexahydro-1H-[1,4]diazepino[1,7-a]indoles: new templates for 5-HT(2C) agonists. Bioorg Med Chem Lett13:2369-72 (2003) 5-hydroxytryptamine receptor 2C
Name:5-hydroxytryptamine receptor 2C
Type:G Protein-Coupled Receptor (GPCR)
Mol. Mass.:51836.79
Organism:Homo sapiens (Human)
Description:P28335
Residue:458
BDBM50130083
NameBDBM50130083
Synonyms:2,3,4,5-Tetrahydro-1H-[1,4]diazepino[1,7-a]indole-11-carbaldehyde | CHEMBL310473
TypeSmall organic molecule
Emp. Form.C13H14N2O
Mol. Mass.214.2631
SMILESO=Cc1c2CCNCCn2c2ccccc12