Reaction Details
TargetSodium-dependent serotonin transporter
LigandBDBM50130159
Substrate/Competitorn/a
Meas. Tech.ChEBML_201993
Ki 0.990000±n/a nM
Citation Takeuchi, KKohn, TJHonigschmidt, NARocco, VPSpinazze, PGKoch, DJAtkinson, STHertel, LWNelson, DLWainscott, DBAhmad, LJShaw, JThrelkeld, PGWong, DT Advances Toward new antidepressants beyond SSRIs: 1-aryloxy-3-piperidinylpropan-2-ols with dual 5-HT(1A) receptor antagonism/SSRI activities. Part 2. Bioorg Med Chem Lett13:2393-7 (2003) Sodium-dependent serotonin transporter
Name:Sodium-dependent serotonin transporter
Type:Multi-pass membrane protein
Mol. Mass.:70168.43
Organism:Rattus norvegicus (rat)
Description:P31652
Residue:630
BDBM50130159
NameBDBM50130159
Synonyms:(S)-1-[(4R,6S)-4-(5-Fluoro-benzo[b]thiophen-2-yl)-2-methyl-piperidin-1-yl]-3-(1H-indol-4-yloxy)-propan-2-ol | CHEMBL79205
TypeSmall organic molecule
Emp. Form.C25H27FN2O2S
Mol. Mass.438.557
SMILESC[C@@H]1C[C@H](CCN1C[C@H](O)COc1cccc2[nH]ccc12)c1cc2cc(F)ccc2s1