Reaction Details
TargetReceptor-type tyrosine-protein phosphatase alpha
LigandBDBM50131553
Substrate/Competitorn/a
Meas. Tech.ChEMBL_207134 (CHEMBL805118)
Ki 120±n/a nM
Citation Liu, GXin, ZLiang, HAbad-Zapatero, CHajduk, PJJanowick, DASzczepankiewicz, BGPei, ZHutchins, CWBallaron, SJStashko, MALubben, THBerg, CERondinone, CMTrevillyan, JMJirousek, MR Selective protein tyrosine phosphatase 1B inhibitors: targeting the second phosphotyrosine binding site with non-carboxylic acid-containing ligands. J Med Chem46:3437-40 (2003) 
 
Receptor-type tyrosine-protein phosphatase alpha
Name:Receptor-type tyrosine-protein phosphatase alpha
Type:Enzyme
Mol. Mass.:90719.02
Organism:Homo sapiens (Human)
Description:P18433
Residue:802
BDBM50131553
NameBDBM50131553
Synonyms:2-[(4-{2-Acetylamino-2-[4-(3-hydroxy-2-nitro-phenoxy)-butylcarbamoyl]-ethyl}-2-ethyl-phenyl)-oxalyl-amino]-benzoic acid | CHEMBL116692
TypeSmall organic molecule
Emp. Form.C32H34N4O11
Mol. Mass.650.6326
SMILESCCc1cc(CC(NC(C)=O)C(=O)NCCCCOc2cccc(O)c2[N+]([O-])=O)ccc1N(C(=O)C(O)=O)c1ccccc1C(O)=O