Reaction Details
TargetIndoleamine 2,3-dioxygenase 1
LigandBDBM50567132
Substrate/Competitorn/a
Meas. Tech.ChEMBL_2102391 (CHEMBL4810787)
IC50 0.100000±n/a nM
Citation Yu, WDeng, YSloman, DLi, DLiu, KFradera, XLesburg, CAMartinot, TDoty, AFerguson, HRichard Miller, JKnemeyer, IOtte, KVincent, SSciammetta, NJonathan Bennett, DHan, Y Discovery of IDO1 inhibitors containing a decahydroquinoline, decahydro-1,6-naphthyridine, or octahydro-1H-pyrrolo[3,2-c]pyridine scaffold. Bioorg Med Chem Lett49:0 (2021) 
 
Indoleamine 2,3-dioxygenase 1
Name:Indoleamine 2,3-dioxygenase 1
Type:Enzyme
Mol. Mass.:45330.80
Organism:Homo sapiens (Human)
Description:P14902
Residue:403
BDBM50567132
NameBDBM50567132
Synonyms:CHEMBL4863767
TypeSmall organic molecule
Emp. Form.C25H28F4N4O
Mol. Mass.476.5096
SMILESFc1ccc(NC(=O)C2(CCC2)C2CCC3C(CCCN3c3ccnc(n3)C(F)(F)F)C2)cc1