Reaction Details
TargetProtein tyrosine phosphatase receptor type C-associated protein
LigandBDBM50131860
Substrate/Competitorn/a
Meas. Tech.ChEMBL_210866 (CHEMBL812679)
Ki 42000000±n/a nM
Citation Swierczek, KPandey, ASPeters, JWHengge, AC A comparison of phosphonothioic acids with phosphonic acids as phosphatase inhibitors. J Med Chem46:3703-8 (2003) 
 
Protein tyrosine phosphatase receptor type C-associated protein
Name:Protein tyrosine phosphatase receptor type C-associated protein
Type:PROTEIN
Mol. Mass.:21182.08
Organism:Homo sapiens (Human)
Description:ChEMBL_210870
Residue:206
BDBM50131860
NameBDBM50131860
Synonyms:6-Phosphono-hexanoic acid | CHEMBL122539
TypeSmall organic molecule
Emp. Form.C6H13O5P
Mol. Mass.196.1382
SMILESOC(=O)CCCCCP(O)(O)=O