Reaction Details
TargetAlkaline phosphatase, tissue-nonspecific isozyme
LigandBDBM50131864
Substrate/Competitorn/a
Meas. Tech.ChEMBL_29961 (CHEMBL640395)
Ki 610000±n/a nM
Citation Swierczek, KPandey, ASPeters, JWHengge, AC A comparison of phosphonothioic acids with phosphonic acids as phosphatase inhibitors. J Med Chem46:3703-8 (2003) 
 
Alkaline phosphatase, tissue-nonspecific isozyme
Name:Alkaline phosphatase, tissue-nonspecific isozyme
Type:PROTEIN
Mol. Mass.:57663.75
Organism:Rattus norvegicus
Description:ChEMBL_29968
Residue:524
BDBM50131864
NameBDBM50131864
Synonyms:CHEMBL125296 | Propyl-phosphonic acid
TypeSmall organic molecule
Emp. Form.C3H9O3P
Mol. Mass.124.0755
SMILESCCCP(O)(O)=O