Reaction Details
TargetAlkaline phosphatase, tissue-nonspecific isozyme
LigandBDBM50131868
Substrate/Competitorn/a
Meas. Tech.ChEMBL_29961 (CHEMBL640395)
Ki 300000±n/a nM
Citation Swierczek, KPandey, ASPeters, JWHengge, AC A comparison of phosphonothioic acids with phosphonic acids as phosphatase inhibitors. J Med Chem46:3703-8 (2003) 
 
Alkaline phosphatase, tissue-nonspecific isozyme
Name:Alkaline phosphatase, tissue-nonspecific isozyme
Type:PROTEIN
Mol. Mass.:57663.75
Organism:Rattus norvegicus
Description:ChEMBL_29968
Residue:524
BDBM50131868
NameBDBM50131868
Synonyms:7-Phosphonomethyl-naphthalene-1-carboxylic acid | CHEMBL123495
TypeSmall organic molecule
Emp. Form.C12H11O5P
Mol. Mass.266.1865
SMILESOC(=O)c1cccc2ccc(CP(O)(O)=O)cc12