Reaction Details
TargetSerine/threonine-protein phosphatase
LigandBDBM50131868
Substrate/Competitorn/a
Meas. Tech.ChEMBL_96757 (CHEMBL705380)
Ki 130000±n/a nM
Citation Swierczek, KPandey, ASPeters, JWHengge, AC A comparison of phosphonothioic acids with phosphonic acids as phosphatase inhibitors. J Med Chem46:3703-8 (2003) 
 
Serine/threonine-protein phosphatase
Name:Serine/threonine-protein phosphatase
Synonyms:PP_LAMBD
Type:PROTEIN
Mol. Mass.:25214.95
Organism:Enterobacteria phage lambda
Description:ChEMBL_96757
Residue:221
BDBM50131868
NameBDBM50131868
TypeSmall organic molecule
Emp. Form.C12H11O5P
Mol. Mass.266.1865
SMILESOC(=O)c1cccc2ccc(CP(O)(O)=O)cc12