Reaction Details
TargetD(3) dopamine receptor
LigandBDBM50132013
Substrate/Competitorn/a
Meas. Tech.ChEMBL_62137 (CHEMBL675894)
Ki 0.5±n/a nM
Citation Hackling, AGhosh, RPerachon, SMann, AHöltje, HDWermuth, CGSchwartz, JCSippl, WSokoloff, PStark, H N-(omega-(4-(2-methoxyphenyl)piperazin-1-yl)alkyl)carboxamides as dopamine D2 and D3 receptor ligands. J Med Chem46:3883-99 (2003) 
 
D(3) dopamine receptor
Name:D(3) dopamine receptor
Type:n/a
Mol. Mass.:44243.43
Organism:Homo sapiens (Human)
Description:n/a
Residue:400
BDBM50132013
NameBDBM50132013
Synonyms:CHEMBL341542 | N-{4-[4-(2-Methoxy-phenyl)-piperazin-1-yl]-butyl}-3-pyridin-3-yl-acrylamide; oxalic acid
TypeSmall organic molecule
Emp. Form.C23H30N4O2
Mol. Mass.394.5099
SMILESCOc1ccccc1N1CCN(CCCCNC(=O)\C=C\c2cccnc2)CC1