Reaction Details
TargetD(3) dopamine receptor
LigandBDBM50132044
Substrate/Competitorn/a
Meas. Tech.ChEMBL_62137 (CHEMBL675894)
Ki 2.96±n/a nM
Citation Hackling, AGhosh, RPerachon, SMann, AHöltje, HDWermuth, CGSchwartz, JCSippl, WSokoloff, PStark, H N-(omega-(4-(2-methoxyphenyl)piperazin-1-yl)alkyl)carboxamides as dopamine D2 and D3 receptor ligands. J Med Chem46:3883-99 (2003) 
 
D(3) dopamine receptor
Name:D(3) dopamine receptor
Type:n/a
Mol. Mass.:44243.43
Organism:Homo sapiens (Human)
Description:n/a
Residue:400
BDBM50132044
NameBDBM50132044
Synonyms:9-Oxo-9H-fluorene-4-carboxylic acid {4-[4-(2-methoxy-phenyl)-piperazin-1-yl]-butyl}-amide | CHEMBL126834
TypeSmall organic molecule
Emp. Form.C29H31N3O3
Mol. Mass.469.5747
SMILESCOc1ccccc1N1CCN(CCCCNC(=O)c2cccc3C(=O)c4ccccc4-c23)CC1