Reaction Details
TargetD(2) dopamine receptor
LigandBDBM50132059
Substrate/Competitorn/a
Meas. Tech.ChEMBL_60074 (CHEMBL671730)
Ki 10±n/a nM
Citation Hackling, AGhosh, RPerachon, SMann, AHöltje, HDWermuth, CGSchwartz, JCSippl, WSokoloff, PStark, H N-(omega-(4-(2-methoxyphenyl)piperazin-1-yl)alkyl)carboxamides as dopamine D2 and D3 receptor ligands. J Med Chem46:3883-99 (2003) 
 
D(2) dopamine receptor
Name:D(2) dopamine receptor
Type:Cell-surface receptors
Mol. Mass.:50647.10
Organism:Homo sapiens (Human)
Description:P14416
Residue:443
BDBM50132059
NameBDBM50132059
Synonyms:3-(4-Cyano-phenyl)-N-{4-[4-(2-methoxy-phenyl)-piperazin-1-yl]-butyl}-acrylamide; oxalic acid | CHEMBL341241
TypeSmall organic molecule
Emp. Form.C25H30N4O2
Mol. Mass.418.5313
SMILESCOc1ccccc1N1CCN(CCCCNC(=O)\C=C\c2ccc(cc2)C#N)CC1