Reaction Details
TargetD(2) dopamine receptor
LigandBDBM50132060
Substrate/Competitorn/a
Meas. Tech.ChEMBL_60074 (CHEMBL671730)
Ki 20±n/a nM
Citation Hackling, AGhosh, RPerachon, SMann, AHöltje, HDWermuth, CGSchwartz, JCSippl, WSokoloff, PStark, H N-(omega-(4-(2-methoxyphenyl)piperazin-1-yl)alkyl)carboxamides as dopamine D2 and D3 receptor ligands. J Med Chem46:3883-99 (2003) 
 
D(2) dopamine receptor
Name:D(2) dopamine receptor
Type:Cell-surface receptors
Mol. Mass.:50647.10
Organism:Homo sapiens (Human)
Description:P14416
Residue:443
BDBM50132060
NameBDBM50132060
Synonyms:3-(3-Chloro-phenyl)-N-{4-[4-(2-methoxy-phenyl)-piperazin-1-yl]-butyl}-acrylamide; oxalic acid | CHEMBL127912
TypeSmall organic molecule
Emp. Form.C24H30ClN3O2
Mol. Mass.427.967
SMILESCOc1ccccc1N1CCN(CCCCNC(=O)\C=C\c2cccc(Cl)c2)CC1